{"text_format":"3","workbook":"xlsx","n_sheets":17,"sheets":["Intro&Instructions","Release Notes","FPCalculationForm England","FPCalculationForm Wales","FPCalculationForm Scotland","params_eng","params_sco","Scotland MIS Backing","Sheet3","Sheet4","Sheet5","CommunityFPDatabase England","CommunityFPDatabase Wales","CommunityFPDatabase Scotland","DataCollectionFormEng (PRINT)","DataCollectionFormWal (PRINT)","DataCollectionFormSco (PRINT)"],"not_rendered":{"images":6,"macros":1,"defined_names":8,"comments":6},"read":"whole","date_system":"1900"}

{"sheet":"Intro&Instructions","index":0,"n_rows":53,"n_cols":4,"rows_kept":53,"merged":[[2,2,2,7],[6,2,6,9],[8,2,9,7],[19,2,19,9],[25,2,25,9],[26,2,26,9],[27,2,27,9],[29,2,29,9],[30,2,30,9],[31,2,31,9],[32,2,32,9],[36,3,36,9],[37,3,37,9],[38,3,38,9],[39,3,39,9],[40,3,40,9],[41,3,41,9],[42,3,44,9],[46,2,50,10]]}
[]
[]
[null,null,"FUEL POVERTY CALCULATOR"]
[null,null,"Last updated: 27/02/2026"]
[]
[]
[null,null,"The Fuel Poverty Calculator is a free Microsoft Excel tool that allows users to input occupancy information, income, housing costs and energy bill details to estimate fuel poverty status in England, Scotland, and Wales."]
[]
[null,null,"The process of calculating fuel poverty using the old and new definitions requires some or all of the following information (depending on the definition):"]
[]
[null,null,"• Total number of people in the household (permanent residents)"]
[null,null,"• Number of adults"]
[null,null,"• Number of children (under 14)*"]
[null,null,"• Number of children (0-1)†"]
[null,null,"• Number of children (2-4)†"]
[null,null,"• Number of children (primary school age)†"]
[null,null,"• Number of children (secondary school age)†"]
[null,null,"• Annual total household net income (including income from benefits, tax credits and savings)"]
[null,null,"• Annual fuel costs for heating, water heating, lights, appliances and cooking"]
[null,null,"• Annual housing costs (mortgage repayments and/or rent costs; for the full details on the calculation of a 'fuel poverty income' see the diagram below)"]
{"$rows_left_out":34}
{"sheet":"Release Notes","index":1,"n_rows":7,"n_cols":3,"rows_kept":7,"merged":[[2,2,2,7],[3,2,3,7],[4,2,5,7],[6,2,6,9]]}
[]
[]
[null,null,"FUEL POVERTY CALCULATOR"]
[null,null,"Release notes - February 2026"]
[]
[]
[null,null,"This updated version of the Fuel Poverty Calculator determines fuel poverty status for England using the LILEE definition of fuel poverty. It also now determines fuel poverty status for Scotland using the Scottish fuel poverty definition and builds out a separate, more accurate calculation form for Wales. The tool also includes England's former LIHC definition and \"10% indicator\" definition of fuel poverty.\n\nThe thresholds for income and fuel costs for England come from the \"Annual Fuel Poverty Statistics in England (2024 data)\" released in March 2025. Calculations for England have been completed following guidance from the Fuel Poverty Methodology Handbook from the Department for Energy Security & Net Zero (DESNZ).\n\nFor Scotland, results from the online Minimum Income Calculator have been used to establish an income threshold (https://www.minimumincome.org.uk/).\n\nFor Wales, a simple calculation has been made based on the 10% definiton. "]

{"sheet":"FPCalculationForm England","index":2,"n_rows":86,"n_cols":7,"rows_kept":86,"merged":[[2,1,4,5],[29,2,29,3],[30,2,30,3],[31,2,31,3],[32,2,32,3],[33,2,33,3],[34,2,34,3],[35,2,35,3],[41,2,41,3],[42,2,42,3],[46,2,46,3],[47,2,47,3],[49,2,49,3],[52,2,52,4],[59,2,59,3],[66,2,66,3],[68,2,68,3],[70,2,70,3],[77,1,79,5],[78,7,78,14],[79,7,79,14],[80,1,80,5],[80,6,81,8],[81,1,81,5],[82,1,82,5],[82,6,83,8],[83,1,83,3],[83,4,83,5],[84,1,84,5],[84,6,85,8],[85,1,85,3],[85,4,85,5],[86,1,86,5],[89,2,89,6]]}
[]
[]
[null,"FUEL POVERTY CALCULATION FORM"]
[]
[]
[]
[null,null,"Title"]
[null,null,"First name"]
[null,null,"Surname"]
[null,null,"Flat number"]
[null,null,"Building name"]
[null,null,"Building number"]
[null,null,"Street"]
[null,null,"District"]
[null,null,"Town"]
[null,null,"County"]
[null,null,"Post code"]
[]
[]
[null,null,"Household income"]
{"$rows_left_out":67}
{"sheet":"FPCalculationForm Wales","index":3,"n_rows":51,"n_cols":6,"rows_kept":51,"merged":[[2,1,4,5],[29,2,29,3],[30,2,30,3],[31,2,31,3],[32,2,32,3],[33,2,33,3],[34,2,34,3],[37,2,37,4],[44,2,44,3],[46,1,48,5],[47,7,47,14],[48,7,48,14],[49,1,49,5],[49,6,50,8],[50,1,50,3],[50,4,50,5],[51,1,51,5],[54,2,54,6]]}
[]
[]
[null,"FUEL POVERTY CALCULATION FORM"]
[]
[]
[]
[null,null,"Title"]
[null,null,"First name"]
[null,null,"Surname"]
[null,null,"Flat number"]
[null,null,"Building name"]
[null,null,"Building number"]
[null,null,"Street"]
[null,null,"District"]
[null,null,"Town"]
[null,null,"County"]
[null,null,"Post code"]
[]
[]
[null,null,"Household income"]
{"$rows_left_out":32}
{"sheet":"FPCalculationForm Scotland","index":4,"n_rows":88,"n_cols":6,"rows_kept":88,"merged":[[2,1,4,5],[30,2,30,3],[31,2,31,3],[32,2,32,3],[33,2,33,3],[34,2,34,3],[35,2,35,3],[42,2,42,3],[43,2,43,3],[47,2,47,3],[48,2,48,3],[52,2,52,3],[55,2,55,4],[62,2,62,3],[66,2,66,3],[71,2,71,3],[73,2,73,3],[74,2,74,3],[76,2,76,3],[80,2,80,3],[82,1,84,5],[85,1,85,5],[85,6,86,8],[86,1,86,3],[86,4,86,5],[87,1,87,3],[87,4,87,5],[87,6,87,8],[88,1,88,5],[91,2,91,6]]}
[]
[]
[null,"FUEL POVERTY CALCULATION FORM"]
[]
[]
[]
[null,null,"Title"]
[null,null,"First name"]
[null,null,"Surname"]
[null,null,"Flat number"]
[null,null,"Building name"]
[null,null,"Building number"]
[null,null,"Street"]
[null,null,"District"]
[null,null,"Town"]
[null,null,"County"]
[null,null,"Post code"]
[]
[]
[null,null,"Household income"]
{"$rows_left_out":69}
{"sheet":"params_eng","index":5,"n_rows":26,"n_cols":10,"rows_kept":26,"hidden":true}
[]
[]
[null,"Needs annual update/check"]
[null,"Equivalised required fuel costs (£)","Equivalised AHC income (£)"]
[null,"Weighted median","Weighted median"]
[null,{"v":2242,"d":"2242.00"},{"v":30733,"d":"30733.00"}]
[]
[{"$nulls":4},"FUEL COST EQUIV FACTORS",null,null,"INCOME EQUIV FACTORS"]
[null,"Thresholds",{"$nulls":3},"factor",null,null,"factor","factorCalc"]
[null,"Relative low income threshold (60% of median equivalised AHC income)",{"$f":"C6*0.6","v":{"v":18439.8,"d":"£18,439.80"}},1,"1 person",0.82,null,"Initial factor for first adult (HRP)",0.58,{"$f":"IF('FPCalculationForm England'!E67=0,0,I10)","v":{"v":0,"d":"0.00"}}]
[null,"Fuel cost threshold",{"$f":"B6","v":{"v":2242,"d":"£2,242.00"}},2,"2 people",{"v":1,"d":"1.00"},null,"Additional factor for any other adults (14 or over)",0.42,{"$f":"IF('FPCalculationForm England'!E64>1,('FPCalculationForm England'!E64-1)*I11,0)","v":{"v":0,"d":"0.00"}}]
[null,"Relative low income threshold plus fuel cost threshold",{"$f":"C11+C10","v":{"v":20681.8,"d":"£20,681.80"}},3,"3 people",1.07,null,"Factor for children (under 14)",{"v":0.2,"d":"0.20"},{"$f":"IF('FPCalculationForm England'!E65=0,0,('FPCalculationForm England'!E65*I12))","v":{"v":0,"d":"0.00"}}]
[{"$nulls":3},4,"4 people",1.21,{"$nulls":3},{"$f":"SUM(J10:J12)","v":{"v":0,"d":"0.00"}}]
[null,"Calculations",null,5,"5 or more people",1.32]
["LILEE","Is FPEER likely to be below 68.5 (based on EPC band below C)?",{"$f":"IF(OR('FPCalculationForm England'!E75=\"A\",'FPCalculationForm England'!E75=\"B\",'FPCalculationForm England'!E75=\"C\"),0,1)","v":1},null,null,{"$f":"IFERROR(VLOOKUP(IF('FPCalculationForm England'!E67>5,5,'FPCalculationForm England'!E67),D10:F14,3),\"\")","v":""}]
["LIHC","Is annual equivalised fuel costs greater than fuel cost threshold?",{"$f":"IF('FPCalculationForm England'!E69>C11,1,0)","v":0}]
[null,"Equivalised AHC income minus equivalised fuel costs",{"$f":"'FPCalculationForm England'!E71-'FPCalculationForm England'!E69","v":{"v":0,"d":"£0.00"}}]
["LIHC and LILEE","Is the above value below the relative low income threshold?",{"$f":"IF(C17<C10,1,0)","v":1},null,"Warm home discount dropdown","EPC bands",null,"Title dropdown"]
[{"$nulls":4},"Yes","A",null,"Mrs"]
[{"$nulls":4},"No","B",null,"Mr"]
{"$rows_left_out":7}
{"sheet":"params_sco","index":6,"n_rows":134,"n_cols":8,"rows_kept":134,"hidden":true}
[]
[]
[null,"Needs annual update/check"]
[null,"MIS baseline (£)"]
[null,{"$f":"'Scotland MIS Backing'!M4","v":34275.28}]
[]
[{"$nulls":4},"SCOTTISH INCOME EQUIV FACTORS"]
[null,"Thresholds",{"$nulls":3},"Factor","Factor Calc"]
[null,"Minimum income standard",{"$f":"IF(C14=1,_xlfn.XLOOKUP(1,(B28:B134='FPCalculationForm Scotland'!E74)*(params_sco!C28:C134='FPCalculationForm Scotland'!E75)*(params_sco!D28:D134='FPCalculationForm Scotland'!E68)*(params_sco!E28:E134='FPCalculationForm Scotland'!E69)*(params_sco!F28:F134='FPCalculationForm Scotland'!E70)*(params_sco!G28:G134='FPCalculationForm Scotland'!E71),params_sco!H28:H134),B5*G14)","v":{"$error":"#N/A"}},null,"Initial adult (HRP)",0.66,{"$f":"IF('FPCalculationForm Scotland'!E74>0,params_sco!F9,0)","v":{"v":0,"d":"0.00"}}]
[null,"90% of minimum income standard",{"$f":"C9*0.9","v":{"$error":"#N/A"}},null,"Additional factor for any other adults (anyone who has completed secondary school)",0.34,{"$f":"IF('FPCalculationForm Scotland'!E74>1,params_sco!F10*('FPCalculationForm Scotland'!E74-1),0)","v":{"v":0,"d":"0.00"}}]
[null,"Table Check 1 (pensioners)",{"$f":"IF(AND('FPCalculationForm Scotland'!E75<3,'FPCalculationForm Scotland'!E74=0,'FPCalculationForm Scotland'!E72=0),1,0)","v":1},null,"Factor for children",0.41,{"$f":"IF('FPCalculationForm Scotland'!E72>0,params_sco!F11*'FPCalculationForm Scotland'!E72, 0)","v":{"v":0,"d":"0.00"}}]
[null,"Table Check 2 (single parent)",{"$f":"IF(AND('FPCalculationForm Scotland'!E74=1,'FPCalculationForm Scotland'!E72<=3,'FPCalculationForm Scotland'!E75=0),1,0)","v":0},null,"Factor for pensioners HRP",0.53,{"$f":"IF(AND('FPCalculationForm Scotland'!E74=0,'FPCalculationForm Scotland'!E75>0),params_sco!F12,0)","v":{"v":0,"d":"0.00"}}]
[null,"Table Check 3 (2 parents)",{"$f":"IF(AND('FPCalculationForm Scotland'!E74=2,'FPCalculationForm Scotland'!E72<=4,'FPCalculationForm Scotland'!E75=0),1,0)","v":0},null,"Additional factor for pensioners",0.27,{"$f":"_xlfn.IFS(AND('FPCalculationForm Scotland'!E74=0,'FPCalculationForm Scotland'!E75>1),params_sco!F13*('FPCalculationForm Scotland'!E75-1),AND('FPCalculationForm Scotland'!E74>0,'FPCalculationForm Scotland'!E75>0),params_sco!F13*'FPCalculationForm Scotland'!E75,TRUE,0)","v":{"v":0,"d":"0.00"}}]
[null,"MIS calculator valid?",{"$f":"IF(SUM(C11:C13)=1,1,0)","v":1},{"$nulls":3},{"$f":"SUM(G9:G13)","v":{"v":0,"d":"0.00"}}]
[]
[{"$nulls":4},"Warm home discount dropdown"]
[null,"Calculations",null,null,"Yes"]
[null,"Is more than 10% of net income AHC required to pay for fuel? (Fuel poverty) (clause a)",{"$f":"IF(('FPCalculationForm Scotland'!E63/'FPCalculationForm Scotland'!E53)>0.1,1,0)","v":{"$error":"#DIV/0!"}},null,"No"]
[null,"Is more than 20% of net income AHC required to pay for fuel? (Extreme fuel poverty)",{"$f":"IF(('FPCalculationForm Scotland'!E63/'FPCalculationForm Scotland'!E53)>0.2,1,0)","v":{"$error":"#DIV/0!"}}]
[null,"Remaining income after removing fuel costs, disability benefits, and childcare costs",{"$f":"'FPCalculationForm Scotland'!E53-'FPCalculationForm Scotland'!E63-'FPCalculationForm Scotland'!E23*12-'FPCalculationForm Scotland'!E81","v":{"v":0,"d":"£0.00"}}]
{"$rows_left_out":115}
{"sheet":"Scotland MIS Backing","index":7,"n_rows":108,"n_cols":13,"rows_kept":108,"hidden":true}
["No. adults","No.pensioners","No children (0-1)","No. children (2-4)","No. children (primary)","No.children (secondary)","Total children","Weekly MIS","Annual MIS",null,null,"Factor calculation:"]
[0,1,0,0,0,0,0,{"v":349.04,"d":"£349.04"},{"$f":"H2*52","v":{"v":18150.08,"d":"£18,150.08"}}]
[0,2,0,0,0,0,0,{"v":525.63,"d":"£525.63"},{"$f":"H3*52","v":{"v":27332.76,"d":"£27,332.76"}},null,null,"Single Adult:",{"$f":"_xlfn.XLOOKUP(1,(A:A=1)*(B:B=0)*(G:G=0),I:I)","v":{"v":22763.52,"d":"£22,763.52"}}]
[1,0,0,0,0,0,0,{"v":437.76,"d":"£437.76"},{"v":22763.52,"d":"£22,763.52"},null,null,"Adult couple:",{"$f":"_xlfn.XLOOKUP(1,(A:A=2)*(B:B=0)*(G:G=0),I:I)","v":{"v":34275.28,"d":"£34,275.28"}}]
[2,0,0,0,0,0,0,{"v":659.14,"d":"£659.14"},{"v":34275.28,"d":"£34,275.28"},null,null,"Single pensioner:",{"$f":"_xlfn.XLOOKUP(1,(A:A=0)*(B:B=1)*(G:G=0),I:I)","v":{"v":18150.08,"d":"£18,150.08"}}]
[1,0,1,0,0,0,1,{"v":896.07,"d":"£896.07"},{"v":46595.64,"d":"£46,595.64"},null,null,"Pensioner couple:",{"$f":"_xlfn.XLOOKUP(1,(A:A=0)*(B:B=2)*(G:G=0),I:I)","v":{"v":27332.76,"d":"£27,332.76"}}]
[2,0,1,0,0,0,1,{"v":1066.07,"d":"£1,066.07"},{"v":55435.64,"d":"£55,435.64"},null,null,"Adult couple 2 children (0-2, primary):",{"$f":"_xlfn.XLOOKUP(1,(A:A=2)*(B:B=0)*(D:D=1)*(E:E=1),I:I)","v":{"v":62144.67999999999,"d":"£62,144.68"}}]
[1,0,2,0,0,0,2,{"v":1258.61,"d":"£1,258.61"},{"v":65447.719999999994,"d":"£65,447.72"}]
[2,0,2,0,0,0,2,{"v":1422.26,"d":"£1,422.26"},{"v":73957.52,"d":"£73,957.52"},null,null,"HRP Adult:",{"$f":"M3/M4","v":{"v":0.6641381193676609,"d":"0.66"}}]
[1,0,3,0,0,0,3,{"v":1660.31,"d":"£1,660.31"},{"v":86336.12,"d":"£86,336.12"},null,null,"Additional adult:",{"$f":"1-M9","v":{"v":0.3358618806323391,"d":"0.34"}}]
[2,0,3,0,0,0,3,{"v":1809.48,"d":"£1,809.48"},{"v":94092.96,"d":"£94,092.96"},null,null,"HRP pensioner:",{"$f":"M5/M4","v":{"v":0.5295384895469856,"d":"0.53"}}]
[2,0,0,0,0,4,4,{"v":1460.94,"d":"£1,460.94"},{"v":75968.88,"d":"£75,968.88"},null,null,"Additional pensioner:",{"$f":"(M6-M5)/M4","v":{"v":0.2679097005188578,"d":"0.27"}}]
[1,0,0,1,0,0,1,{"v":803.32,"d":"£803.32"},{"v":41772.64,"d":"£41,772.64"},null,null,"Child:",{"$f":"((M7-M4)/2)/M4","v":{"v":0.4065524774706435,"d":"0.41"}}]
[2,0,0,1,0,0,1,{"v":973.32,"d":"£973.32"},{"v":50612.64,"d":"£50,612.64"}]
[1,0,1,1,0,0,2,{"v":1165.98,"d":"£1,165.98"},{"v":60630.96,"d":"£60,630.96"}]
[2,0,1,1,0,0,2,{"v":1329.63,"d":"£1,329.63"},{"v":69140.76000000001,"d":"£69,140.76"}]
[1,0,2,1,0,0,3,{"v":1567.68,"d":"£1,567.68"},{"v":81519.36,"d":"£81,519.36"}]
[2,0,2,1,0,0,3,{"v":1716.85,"d":"£1,716.85"},{"v":89276.2,"d":"£89,276.20"}]
[2,0,0,0,1,3,4,{"v":1486.73,"d":"£1,486.73"},{"v":77309.96,"d":"£77,309.96"}]
[1,0,0,2,0,0,2,{"v":1073.17,"d":"£1,073.17"},{"v":55804.840000000004,"d":"£55,804.84"}]
{"$rows_left_out":89}
{"sheet":"Sheet3","index":8,"n_rows":2,"n_cols":27,"rows_kept":2,"hidden":true}
["Title","First name","Surname","Flat number","Building name","Building number","Street","District","Town","County","Post code","Annual net household income","Annual mortgage payments","Annual rent payments","Annual income (after housing costs)","Annual fuel costs","Household size","Number of adults (>14 years)","Number of children (<14 years)","Annual equivalised fuel costs","Annual equivalised income (after housing costs)","EPC band","Warm Home Discount?","Fuel poverty status: LILEE definition","Fuel poverty status: LIHC definition","Fuel poverty gap: LIHC definition","Fuel poverty status: 10% definition"]
[{"$f":"IF('FPCalculationForm England'!$D$7=0,\"\",'FPCalculationForm England'!$D$7)","v":""},{"$f":"IF('FPCalculationForm England'!$D$8=0,\"\",'FPCalculationForm England'!$D$8)","v":""},{"$f":"IF('FPCalculationForm England'!$D$9=0,\"\",'FPCalculationForm England'!$D$9)","v":""},{"$f":"IF('FPCalculationForm England'!$D$10=0,\"\",'FPCalculationForm England'!$D$10)","v":""},{"$f":"IF('FPCalculationForm England'!$D$11=0,\"\",'FPCalculationForm England'!$D$11)","v":""},{"$f":"IF('FPCalculationForm England'!$D$12=0,\"\",'FPCalculationForm England'!$D$12)","v":""},{"$f":"IF('FPCalculationForm England'!$D$13=0,\"\",'FPCalculationForm England'!$D$13)","v":""},{"$f":"IF('FPCalculationForm England'!$D$14=0,\"\",'FPCalculationForm England'!$D$14)","v":""},{"$f":"IF('FPCalculationForm England'!$D$15=0,\"\",'FPCalculationForm England'!$D$15)","v":""},{"$f":"IF('FPCalculationForm England'!$D$16=0,\"\",'FPCalculationForm England'!$D$16)","v":""},{"$f":"IF('FPCalculationForm England'!$D$17=0,\"\",'FPCalculationForm England'!$D$17)","v":""},{"$f":"'FPCalculationForm England'!E30","v":{"v":0,"d":"£0"}},{"$f":"'FPCalculationForm England'!E43","v":{"v":0,"d":"£0"}},{"$f":"'FPCalculationForm England'!E48","v":{"v":0,"d":"£0"}},{"$f":"'FPCalculationForm England'!E50","v":{"v":0,"d":"£0"}},{"$f":"'FPCalculationForm England'!E60","v":{"v":0,"d":"£0"}},{"$f":"'FPCalculationForm England'!E67","v":0},{"$f":"'FPCalculationForm England'!E64","v":0},{"$f":"'FPCalculationForm England'!E65","v":0},{"$f":"'FPCalculationForm England'!E69","v":{"v":0,"d":"£0"}},{"$f":"'FPCalculationForm England'!E71","v":{"v":0,"d":"£0"}},{"$f":"IF('FPCalculationForm England'!E75=0,\"\",'FPCalculationForm England'!E75)","v":""},{"$f":"IF('FPCalculationForm England'!E58=0,\"\",'FPCalculationForm England'!E58)","v":""},{"$f":"'FPCalculationForm England'!B81","v":"MISSING VALUE - HOUSEHOLD SIZE"},{"$f":"'FPCalculationForm England'!B83","v":"MISSING VALUE - HOUSEHOLD SIZE"},{"$f":"'FPCalculationForm England'!E84","v":""},{"$f":"'FPCalculationForm England'!B85","v":""}]

{"sheet":"Sheet4","index":9,"n_rows":2,"n_cols":27,"rows_kept":2,"hidden":true}
["Title","First name","Surname","Flat number","Building name","Building number","Street","District","Town","County","Post code","Annual net household income","Annual mortgage payments","Annual rent payments","Annual income (after housing costs)","Annual fuel costs","Household size","Number of children (0-1)","Number of children (2-4)","Number of children (primary)","Number of children (secondary)","Total number of children","Number of adults (non-pensioners)","Number of pensioners","Warm Home Discount?","Fuel poverty status","Fuel poverty gap"]
[{"$f":"IF('FPCalculationForm Scotland'!D7=0,\"\",'FPCalculationForm Scotland'!D7)","v":""},{"$f":"IF('FPCalculationForm Scotland'!D8=0,\"\",'FPCalculationForm Scotland'!D8)","v":""},{"$f":"IF('FPCalculationForm Scotland'!D9=0,\"\",'FPCalculationForm Scotland'!D9)","v":""},{"$f":"IF('FPCalculationForm Scotland'!D10=0,\"\",'FPCalculationForm Scotland'!D10)","v":""},{"$f":"IF('FPCalculationForm Scotland'!D11=0,\"\",'FPCalculationForm Scotland'!D11)","v":""},{"$f":"IF('FPCalculationForm Scotland'!D12=0,\"\",'FPCalculationForm Scotland'!D12)","v":""},{"$f":"IF('FPCalculationForm Scotland'!D13=0,\"\",'FPCalculationForm Scotland'!D13)","v":""},{"$f":"IF('FPCalculationForm Scotland'!D14=0,\"\",'FPCalculationForm Scotland'!D14)","v":""},{"$f":"IF('FPCalculationForm Scotland'!D15=0,\"\",'FPCalculationForm Scotland'!D15)","v":""},{"$f":"IF('FPCalculationForm Scotland'!D16=0,\"\",'FPCalculationForm Scotland'!D16)","v":""},{"$f":"IF('FPCalculationForm Scotland'!D17=0,\"\",'FPCalculationForm Scotland'!D17)","v":""},{"$f":"'FPCalculationForm Scotland'!E31","v":{"v":0,"d":"£0"}},{"$f":"'FPCalculationForm Scotland'!E44","v":{"v":0,"d":"£0"}},{"$f":"'FPCalculationForm Scotland'!E49","v":{"v":0,"d":"£0"}},{"$f":"'FPCalculationForm Scotland'!E53","v":{"v":0,"d":"£0"}},{"$f":"'FPCalculationForm Scotland'!E63","v":{"v":0,"d":"£0"}},{"$f":"'FPCalculationForm Scotland'!E77","v":0},{"$f":"IF('FPCalculationForm Scotland'!E68=0,0,'FPCalculationForm Scotland'!E68)","v":0},{"$f":"IF('FPCalculationForm Scotland'!E69=0,0,'FPCalculationForm Scotland'!E69)","v":0},{"$f":"IF('FPCalculationForm Scotland'!E70=0,0,'FPCalculationForm Scotland'!E70)","v":0},{"$f":"IF('FPCalculationForm Scotland'!E71=0,0,'FPCalculationForm Scotland'!E71)","v":0},{"$f":"IF('FPCalculationForm Scotland'!E72=0,0,'FPCalculationForm Scotland'!E72)","v":0},{"$f":"IF('FPCalculationForm Scotland'!E74=0,0,'FPCalculationForm Scotland'!E74)","v":0},{"$f":"IF('FPCalculationForm Scotland'!E75=0,0,'FPCalculationForm Scotland'!E75)","v":0},{"$f":"IF('FPCalculationForm Scotland'!E61=0,\"\",'FPCalculationForm Scotland'!E61)","v":""},{"$f":"'FPCalculationForm Scotland'!B86","v":"MISSING VALUE - HOUSEHOLD SIZE"},{"$f":"'FPCalculationForm Scotland'!E87","v":""}]

{"sheet":"Sheet5","index":10,"n_rows":2,"n_cols":15,"rows_kept":2,"hidden":true}
["Title","First name","Surname","Flat number","Building name","Building number","Street","District","Town","County","Post code","Annual net household income","Annual fuel costs","Warm Home Discount?","Fuel poverty status"]
[{"$f":"IF('FPCalculationForm Wales'!$D$7=0,\"\",'FPCalculationForm Wales'!$D$7)","v":""},{"$f":"IF('FPCalculationForm Wales'!$D$8=0,\"\",'FPCalculationForm Wales'!$D$8)","v":""},{"$f":"IF('FPCalculationForm Wales'!$D$9=0,\"\",'FPCalculationForm Wales'!$D$9)","v":""},{"$f":"IF('FPCalculationForm Wales'!$D$10=0,\"\",'FPCalculationForm Wales'!$D$10)","v":""},{"$f":"IF('FPCalculationForm Wales'!$D$11=0,\"\",'FPCalculationForm Wales'!$D$11)","v":""},{"$f":"IF('FPCalculationForm Wales'!$D$12=0,\"\",'FPCalculationForm Wales'!$D$12)","v":""},{"$f":"IF('FPCalculationForm Wales'!$D$13=0,\"\",'FPCalculationForm Wales'!$D$13)","v":""},{"$f":"IF('FPCalculationForm Wales'!$D$14=0,\"\",'FPCalculationForm Wales'!$D$14)","v":""},{"$f":"IF('FPCalculationForm Wales'!$D$15=0,\"\",'FPCalculationForm Wales'!$D$15)","v":""},{"$f":"IF('FPCalculationForm Wales'!$D$16=0,\"\",'FPCalculationForm Wales'!$D$16)","v":""},{"$f":"IF('FPCalculationForm Wales'!$D$17=0,\"\",'FPCalculationForm Wales'!$D$17)","v":""},{"$f":"'FPCalculationForm Wales'!E30","v":{"v":0,"d":"£0"}},{"$f":"'FPCalculationForm Wales'!E45","v":{"v":0,"d":"£0"}},{"$f":"'FPCalculationForm Wales'!E43","v":0},{"$f":"'FPCalculationForm Wales'!B50","v":""}]

{"sheet":"CommunityFPDatabase England","index":11,"n_rows":1,"n_cols":27,"rows_kept":1}
["Title","First name","Surname","Flat number","Building name","Building number","Street","District","Town","County","Post code","Annual net household income","Annual mortgage payments","Annual rent payments","Annual income (after housing costs)","Annual fuel costs","Household size","Number of adults (>14 years)","Number of children (<14 years)","Annual equivalised fuel costs","Annual equivalised income (after housing costs)","EPC band","Warm Home Discount?","Fuel poverty status: LILEE definition","Fuel poverty status: LIHC definition","Fuel poverty gap: LIHC definition","Fuel poverty status: 10% definition"]

{"sheet":"CommunityFPDatabase Wales","index":12,"n_rows":1,"n_cols":15,"rows_kept":1}
["Title","First name","Surname","Flat number","Building name","Building number","Street","District","Town","County","Post code","Annual net household income","Annual fuel costs","Warm Home Discount?","Fuel poverty status"]

{"sheet":"CommunityFPDatabase Scotland","index":13,"n_rows":1,"n_cols":27,"rows_kept":1}
["Title","First name","Surname","Flat number","Building name","Building number","Street","District","Town","County","Post code","Annual net household income","Annual mortgage payments","Annual rent payments","Annual income (after housing costs)","Annual fuel costs","Household size","Number of children (0-1)","Number of children (2-4)","Number of children (primary)","Number of children (secondary)","Total number of children","Number of adults (non-pensioners)","Number of pensioners","Warm Home Discount?","Fuel poverty status","Fuel poverty gap"]

{"sheet":"DataCollectionFormEng (PRINT)","index":14,"n_rows":102,"n_cols":5,"rows_kept":102,"merged":[[3,1,5,4],[7,2,7,3],[8,2,8,3],[9,2,9,3],[10,2,10,3],[11,2,11,3],[12,2,12,3],[13,2,13,3],[14,2,14,3],[15,2,15,3],[16,2,16,3],[17,2,17,3],[55,2,55,3]]}
[]
[]
[]
[null,"FUEL POVERTY DATA COLLECTION QUESTIONNAIRE"]
[]
[]
[]
[null,null,"Title:"]
[null,null,"First name:"]
[null,null,"Surname:"]
[null,null,"Flat Number:"]
[null,null,"Building name:"]
[null,null,"Building number:"]
[null,null,"Street:"]
[null,null,"District:"]
[null,null,"Town:"]
[null,null,"County:"]
[null,null,"Post code:"]
[]
[]
{"$rows_left_out":83}
{"sheet":"DataCollectionFormWal (PRINT)","index":15,"n_rows":96,"n_cols":5,"rows_kept":96,"merged":[[3,1,5,4],[7,2,7,3],[8,2,8,3],[9,2,9,3],[10,2,10,3],[11,2,11,3],[12,2,12,3],[13,2,13,3],[14,2,14,3],[15,2,15,3],[16,2,16,3],[17,2,17,3],[49,2,49,3]]}
[]
[]
[]
[null,"FUEL POVERTY DATA COLLECTION QUESTIONNAIRE"]
[]
[]
[]
[null,null,"Title:"]
[null,null,"First name:"]
[null,null,"Surname:"]
[null,null,"Flat Number:"]
[null,null,"Building name:"]
[null,null,"Building number:"]
[null,null,"Street:"]
[null,null,"District:"]
[null,null,"Town:"]
[null,null,"County:"]
[null,null,"Post code:"]
[]
[]
{"$rows_left_out":77}
{"sheet":"DataCollectionFormSco (PRINT)","index":16,"n_rows":106,"n_cols":5,"rows_kept":106,"merged":[[3,1,5,4],[7,2,7,3],[8,2,8,3],[9,2,9,3],[10,2,10,3],[11,2,11,3],[12,2,12,3],[13,2,13,3],[14,2,14,3],[15,2,15,3],[16,2,16,3],[17,2,17,3],[59,2,59,3]]}
[]
[]
[]
[null,"FUEL POVERTY DATA COLLECTION QUESTIONNAIRE"]
[]
[]
[]
[null,null,"Title:"]
[null,null,"First name:"]
[null,null,"Surname:"]
[null,null,"Flat Number:"]
[null,null,"Building name:"]
[null,null,"Building number:"]
[null,null,"Street:"]
[null,null,"District:"]
[null,null,"Town:"]
[null,null,"County:"]
[null,null,"Post code:"]
[]
[]
{"$rows_left_out":86}